BDBM321606 US10183021, Compound I-352
SMILES OCC(O)(CCl)CNc1nc(ncc1F)-c1cc(-c2ccon2)n(Cc2ccccc2F)n1
InChI Key InChIKey=IMZSQOLEECCMTM-UHFFFAOYSA-N
Data  1 EC50
  Tab Delimited (TSV)   2D SDfile   Computed 3D by Vconf -m prep SDfile
Find this compound or compounds like it in BindingDB:
Activity Spreadsheet -- Enzyme Inhibition Constant Data from BindingDB
Found 1 hit for monomerid = 321606
TargetGuanylate cyclase soluble subunit alpha-1(Homo sapiens (Human))
Ironwood Pharmaceuticals
US Patent
LigandPNGBDBM321606(US10183021, Compound I-352)
Affinity DataEC50: <100nM. Assay description: Human embryonic kidney cells (HEK293), endogenously expressing soluble guanylate cyclase (sGC), were used to evaluate the activity of test compounds....
Ligand InfoPC cidPC sid
In DepthDetails US Patent