BDBM321685 US10183021, Compound I-459
SMILES Fc1ccccc1Cn1nc(cc1-c1ccon1)-c1nccc(NC(=O)C2CCC(=O)N2)n1
InChI Key InChIKey=YEEGOJDNVCJBCL-UHFFFAOYSA-N
Data  1 EC50
  Tab Delimited (TSV)   2D SDfile   Computed 3D by Vconf -m prep SDfile
Find this compound or compounds like it in BindingDB:
Activity Spreadsheet -- Enzyme Inhibition Constant Data from BindingDB
Found 1 hit for monomerid = 321685
TargetGuanylate cyclase soluble subunit alpha-1(Homo sapiens (Human))
Ironwood Pharmaceuticals
US Patent
LigandPNGBDBM321685(US10183021, Compound I-459)
Affinity DataEC50: >1.00E+3nM. Assay description: Human embryonic kidney cells (HEK293), endogenously expressing soluble guanylate cyclase (sGC), were used to evaluate the activity of test compounds....
Ligand InfoPC cidPC sid
In DepthDetails US Patent