BDBM321926 (E)-1-(3-(4-Chloro-2-((5-methyl-2H-tetrazol-2-yl)methyl)phenyl)acryloyl)piperidine-3-carboxamide::US10183025, Example 49.8::US9763957, Example 49.8
SMILES Cc1nnn(Cc2cc(Cl)ccc2\C=C\C(=O)N2CCCC(C2)C(N)=O)n1
InChI Key InChIKey=RKIDIYRECRNJCE-FNORWQNLSA-N
Data  2 IC50
  Tab Delimited (TSV)   2D SDfile   Computed 3D by Vconf -m prep SDfile
Find this compound or compounds like it in BindingDB:
Activity Spreadsheet -- Enzyme Inhibition Constant Data from BindingDB
Found 2 hits for monomerid = 321926
TargetAtaxin-1(Homo sapiens (Human))
Novartis
US Patent
LigandPNGBDBM321926((E)-1-(3-(4-Chloro-2-((5-methyl-2H-tetrazol-2-yl)m...)
Affinity DataIC50:  354nM. Assay description: Method All experimental measurements were performed in black 384 well polystyrene (low volume, round bottom, Corning (3676)) plates. PerkinElmer EnVi...
Ligand InfoPC cidPC sid
In DepthDetails US Patent
TargetEctonucleotide pyrophosphatase/phosphodiesterase family member 2(Homo sapiens (Human))
Novartis
US Patent
LigandPNGBDBM321926((E)-1-(3-(4-Chloro-2-((5-methyl-2H-tetrazol-2-yl)m...)
Affinity DataIC50:  354nM. Assay description: Reagents LPC (oleoyl (18:1)) was purchased from Avanti Polar Lipids (Alabaster, Ala.) and solubilized in methanol to 20 mM. Amplex Red was obtained f...
Ligand InfoPC cidPC sid
In DepthDetails US Patent