BDBM322024 (E)-3-(4-Chloro-2-((5-methyl-2H-tetrazol-2-yl)methyl)phenyl)-1-(4-((4-methyl-2H-1,2,3-triazol-2-yl)methyl)piperidin-1-yl)prop-2-en-1-one::US10183025, Example 120::US9763957, Example 120
SMILES Cc1cnn(CC2CCN(CC2)C(=O)\C=C\c2ccc(Cl)cc2Cn2nnc(C)n2)n1
InChI Key InChIKey=HMNNTCOUDVNGTJ-GQCTYLIASA-N
Data  2 IC50
  Tab Delimited (TSV)   2D SDfile   Computed 3D by Vconf -m prep SDfile
Find this compound or compounds like it in BindingDB:
Activity Spreadsheet -- Enzyme Inhibition Constant Data from BindingDB
Found 2 hits for monomerid = 322024
TargetAtaxin-1(Homo sapiens (Human))
Novartis
US Patent
LigandPNGBDBM322024((E)-3-(4-Chloro-2-((5-methyl-2H-tetrazol-2-yl)meth...)
Affinity DataIC50:  8.10nM. Assay description: Method All experimental measurements were performed in black 384 well polystyrene (low volume, round bottom, Corning (3676)) plates. PerkinElmer EnVi...
Ligand InfoPC cidPC sid
In DepthDetails US Patent
TargetEctonucleotide pyrophosphatase/phosphodiesterase family member 2(Homo sapiens (Human))
Novartis
US Patent
LigandPNGBDBM322024((E)-3-(4-Chloro-2-((5-methyl-2H-tetrazol-2-yl)meth...)
Affinity DataIC50:  8.10nM. Assay description: Reagents LPC (oleoyl (18:1)) was purchased from Avanti Polar Lipids (Alabaster, Ala.) and solubilized in methanol to 20 mM. Amplex Red was obtained f...
Ligand InfoPC cidPC sid
In DepthDetails US Patent