BDBM322093 1-{5-[(5-chloro-2-fluorobenzyl)oxy]-1-(2-methylpropyl)-1H-pyrazol-3-yl}-N-methylmethanamine::US10183913, Example 256::US11576897, Example 256
SMILES CNCc1cc(OCc2cc(Cl)ccc2F)n(CC(C)C)n1
InChI Key InChIKey=VOYYHEGRDRQHAX-UHFFFAOYSA-N
Data  5 KI
  Tab Delimited (TSV)   2D SDfile   Computed 3D by Vconf -m prep SDfile
Find this compound or compounds like it in BindingDB:
Activity Spreadsheet -- Enzyme Inhibition Constant Data from BindingDB
Found 5 hits for monomerid = 322093
TargetSodium-dependent serotonin transporter(Homo sapiens (Human))
Sumitomo Dainippon Pharma
US Patent
LigandPNGBDBM322093(1-{5-[(5-chloro-2-fluorobenzyl)oxy]-1-(2-methylpro...)
Affinity DataKi:  1.60nM. Assay description: The [3H] citalopram binding was measured according to the method disclosed in Owens M. J. et al., J. Pharm. Exp. Ther., 283, 1305-1322 (1997). In spe...
Ligand InfoPC cidPC sid
In DepthDetails US Patent
TargetSodium-dependent serotonin transporter(Homo sapiens (Human))
Sumitomo Dainippon Pharma
US Patent
LigandPNGBDBM322093(1-{5-[(5-chloro-2-fluorobenzyl)oxy]-1-(2-methylpro...)
Affinity DataKi:  1.60nM. Assay description: Specifically, a solution containing 50 μL of [3H]-citalopram (GE Healthcare) diluted with SERT buffer (50 mmol/L Tris-HCl (pH=7.4) containing 12...
Ligand InfoPC cidPC sid
In DepthDetails US Patent
Target5-hydroxytryptamine receptor 2A(Homo sapiens (Human))
Sumitomo Pharma
US Patent
LigandPNGBDBM322093(1-{5-[(5-chloro-2-fluorobenzyl)oxy]-1-(2-methylpro...)
Affinity DataKi:  4.5nM. Assay description: 5-HT2A: A solution containing 50 μL of [H]-ketanserin (the final concentration: 1 nM), 2 μL of a solution of a test compound in DMSO or a s...
Ligand InfoPC cidPC sid
In DepthDetails US Patent
Target5-hydroxytryptamine receptor 2C(Homo sapiens)
Sumitomo Pharma
US Patent
LigandPNGBDBM322093(1-{5-[(5-chloro-2-fluorobenzyl)oxy]-1-(2-methylpro...)
Affinity DataKi:  12nM. Assay description: 5-HT2C: A solution containing 50 μL of [H]-mesulergine (GE Healthcare) diluted with 50 mmol/L Tris-HCl (pH=7.4) (the final concentration: about ...
Ligand InfoPC cidPC sid
In DepthDetails US Patent
Target5-hydroxytryptamine receptor 2C(Homo sapiens (Human))
Sumitomo Dainippon Pharma
US Patent
LigandPNGBDBM322093(1-{5-[(5-chloro-2-fluorobenzyl)oxy]-1-(2-methylpro...)
Affinity DataKi:  12nM. Assay description: A solution of 200 μL in total was prepared by mixing 50 μL of [3H] mesulergine (manufactured by GE Healthcare) diluted with 50 mmol/L Tris-...
Ligand InfoPC cidPC sid
In DepthDetails US Patent