BDBM32251 2-(1,3-benzodioxol-5-ylmethyl)isoindole-1,3-dione::2-piperonylisoindoline-1,3-quinone::cid_714424
SMILES O=C1N(Cc2ccc3OCOc3c2)C(=O)c2ccccc12
InChI Key InChIKey=IJOUNEKMVDGTBS-UHFFFAOYSA-N
Data  1 IC50
  Tab Delimited (TSV)   2D SDfile   Computed 3D by Vconf -m prep SDfile
Find this compound or compounds like it in BindingDB:
Activity Spreadsheet -- Enzyme Inhibition Constant Data from BindingDB
Found 1 hit for monomerid = 32251
TargetHeat shock protein HSP 90-alpha(Homo sapiens (Human))
Emory University
Curated by PubChem BioAssay
LigandPNGBDBM32251(2-(1,3-benzodioxol-5-ylmethyl)isoindole-1,3-dione ...)
Affinity DataIC50:  5.00E+4nMpH: 7.4 T: 2°C. Assay description: A fluorescence polarization based HTS assay has been developed and optimized for the identification of Hsp90 inhibitors by using tumor cell lysate Hs...
In DepthDetails PCBioAssay