BDBM322548 US10183940, Example 1
SMILES CC(C)(C)OC(=O)N(CCO)Cc1nccc(Br)c1F
InChI Key InChIKey=GHJGIXSRVPNUSN-UHFFFAOYSA-N
Data  1 EC50
  Tab Delimited (TSV)   2D SDfile   Computed 3D by Vconf -m prep SDfile
Find this compound or compounds like it in BindingDB:
Activity Spreadsheet -- Enzyme Inhibition Constant Data from BindingDB
Found 1 hit for monomerid = 322548
TargetSomatostatin receptor type 4(Homo sapiens (Human))
Boehringer Ingelheim International
US Patent
LigandPNGBDBM322548(US10183940, Example 1)
Affinity DataEC50:  58.1nM. Assay description: The activation of the SSTR4 receptor (Gi coupled) causes an inhibition of intracellular cAMP after stimulation with Forskolin, which can be quantifia...
Ligand InfoPC cidPC sid
In DepthDetails US Patent