BDBM322555 US10183940, Example 8
SMILES CC(C)(NC(=O)c1cccc2CNCCOc12)c1ccc(Cl)c(Cl)c1
InChI Key InChIKey=NVMUCOXJJJHFBF-UHFFFAOYSA-N
Data  1 EC50
  Tab Delimited (TSV)   2D SDfile   Computed 3D by Vconf -m prep SDfile
Find this compound or compounds like it in BindingDB:
Activity Spreadsheet -- Enzyme Inhibition Constant Data from BindingDB
Found 1 hit for monomerid = 322555
TargetSomatostatin receptor type 4(Homo sapiens (Human))
Boehringer Ingelheim International
US Patent
LigandPNGBDBM322555(US10183940, Example 8)
Affinity DataEC50:  22.3nM. Assay description: The activation of the SSTR4 receptor (Gi coupled) causes an inhibition of intracellular cAMP after stimulation with Forskolin, which can be quantifia...
Ligand InfoPC cidPC sid
In DepthDetails US Patent