BDBM32261 MLS000081169::N,N-diethyl-4-(3-pyridin-3-yl-[1,2,4]triazolo[3,4-b][1,3,4]thiadiazol-6-yl)aniline::N,N-diethyl-4-[3-(3-pyridinyl)-[1,2,4]triazolo[3,4-b][1,3,4]thiadiazol-6-yl]aniline::SMR000043558::cid_662880::diethyl-[4-[3-(3-pyridyl)-[1,2,4]triazolo[3,4-b][1,3,4]thiadiazol-6-yl]phenyl]amine
SMILES CCN(CC)c1ccc(cc1)-c1nn2c(nnc2s1)-c1cccnc1
InChI Key InChIKey=OSWNMRLFEDXYOC-UHFFFAOYSA-N
Data  2 EC50
  Tab Delimited (TSV)   2D SDfile   Computed 3D by Vconf -m prep SDfile
Find this compound or compounds like it in BindingDB:
Activity Spreadsheet -- Enzyme Inhibition Constant Data from BindingDB
Found 2 hits for monomerid = 32261
TargetBcl-2-like protein 2(Homo sapiens (Human))
Nmmlsc
Curated by PubChem BioAssay
LigandPNGBDBM32261(MLS000081169 | N,N-diethyl-4-(3-pyridin-3-yl-[1,2,...)
Affinity DataEC50:  1.20E+4nM. Assay description: University of New Mexico Assay Overview: Assay Support: NIH 1X01 MH079850-01 HTS to identify small molecule regulators of Bcl-2 family protein int...
In DepthDetails PCBioAssay
TargetIsoform Bcl-X(L) of Bcl-2-like protein 1 (Bcl-xL)(Homo sapiens (Human))
Nmmlsc
Curated by PubChem BioAssay
LigandPNGBDBM32261(MLS000081169 | N,N-diethyl-4-(3-pyridin-3-yl-[1,2,...)
Affinity DataEC50:  7.92E+3nMpH: 7.4 T: 2°C. Assay description: The HTS assay was conducted in 384-well microplates in a total assay volume per well of 10.1 microliters (5 microliters of bead mixture, 0.1 microlit...
In DepthDetails PCBioAssay