BDBM322843 2-(4-(4-((2-(4-(cyanomethyl)piperidin-1- yl)-5-oxo-5,6-dihydropyrimido[4,5- d]pyridazin-4-yl)amino)phenyl)piperazin- 1-yl)-2-methylpropanoic acid::US10183944, Example 213::US10647720, Ex. # 213
SMILES CC(C)(N1CCN(CC1)c1ccc(Nc2nc(nc(C=N)c2C(N)=O)N2CCC(CC#N)CC2)cc1)C(O)=O
InChI Key InChIKey=CHDJUUAJRMMYHT-UHFFFAOYSA-N
Data  4 IC50
  Tab Delimited (TSV)   2D SDfile   Computed 3D by Vconf -m prep SDfile
Find this compound or compounds like it in BindingDB:
Activity Spreadsheet -- Enzyme Inhibition Constant Data from BindingDB
Found 4 hits for monomerid = 322843
TargetTyrosine-protein kinase SYK(Homo sapiens (Human))
Asana Biosciences
US Patent
LigandPNGBDBM322843(2-(4-(4-((2-(4-(cyanomethyl)piperidin-1- yl)-5-oxo...)
Affinity DataIC50: <10nM. Assay description: 2.5 μL of 10% DMSO or compound in 10% DMSO was added to the wells in a 96 well V-bottom plate. Optimized concentration of in-house Syk enzyme (d...
Ligand InfoPC cidPC sid
In DepthDetails US Patent
TargetTyrosine-protein kinase JAK2(Homo sapiens (Human))
Asan Biosciences
US Patent
LigandPNGBDBM322843(2-(4-(4-((2-(4-(cyanomethyl)piperidin-1- yl)-5-oxo...)
Affinity DataIC50:  30nM. Assay description: Two μL of 10% DMSO in blank, substrate control and positive control wells and 2 μL of test compound in test wells was added. Thirteen μ...
Ligand InfoPC cidPC sid
In DepthDetails US Patent
TargetTyrosine-protein kinase SYK(Homo sapiens (Human))
Asana Biosciences
US Patent
LigandPNGBDBM322843(2-(4-(4-((2-(4-(cyanomethyl)piperidin-1- yl)-5-oxo...)
Affinity DataIC50: <10nM. Assay description: 2.5 μL of 10% DMSO or compound in 10% DMSO was added to the wells in a 96 well V-bottom plate. Optimized concentration of in-house Syk enzyme (d...
Ligand InfoPC cidPC sid
In DepthDetails US Patent
TargetTyrosine-protein kinase JAK2(Homo sapiens (Human))
Asan Biosciences
US Patent
LigandPNGBDBM322843(2-(4-(4-((2-(4-(cyanomethyl)piperidin-1- yl)-5-oxo...)
Affinity DataIC50: <50nM. Assay description: Two μL of 10% DMSO in blank, substrate control and positive control wells and 2 μL of test compound in test wells was added. Thirteen μ...
Ligand InfoPC cidPC sid
In DepthDetails US Patent