BDBM322964 2-(azepan-1-yl)-4-((4-(methylsulfonyl) phenyl)amino)pyrimido[4,5-d]pyridazin- 5(6H)-one::US10183944, Example 334::US10647720, Ex. # 334
SMILES CS(=O)(=O)c1ccc(Nc2nc(nc3cn[nH]c(=O)c23)N2CCCCCC2)cc1
InChI Key InChIKey=RQVSTZRYEAVRET-UHFFFAOYSA-N
Data  4 IC50
  Tab Delimited (TSV)   2D SDfile   Computed 3D by Vconf -m prep SDfile
Find this compound or compounds like it in BindingDB:
Activity Spreadsheet -- Enzyme Inhibition Constant Data from BindingDB
Found 4 hits for monomerid = 322964
TargetTyrosine-protein kinase SYK(Homo sapiens (Human))
Asana Biosciences
US Patent
LigandPNGBDBM322964(2-(azepan-1-yl)-4-((4-(methylsulfonyl) phenyl)amin...)
Affinity DataIC50: <50nM. Assay description: 2.5 μL of 10% DMSO or compound in 10% DMSO was added to the wells in a 96 well V-bottom plate. Optimized concentration of in-house Syk enzyme (d...
Ligand InfoPC cidPC sid
In DepthDetails US Patent
TargetTyrosine-protein kinase JAK2(Homo sapiens (Human))
Asan Biosciences
US Patent
LigandPNGBDBM322964(2-(azepan-1-yl)-4-((4-(methylsulfonyl) phenyl)amin...)
Affinity DataIC50: <10nM. Assay description: Two μL of 10% DMSO in blank, substrate control and positive control wells and 2 μL of test compound in test wells was added. Thirteen μ...
Ligand InfoPC cidPC sid
In DepthDetails US Patent
TargetTyrosine-protein kinase SYK(Homo sapiens (Human))
Asana Biosciences
US Patent
LigandPNGBDBM322964(2-(azepan-1-yl)-4-((4-(methylsulfonyl) phenyl)amin...)
Affinity DataIC50:  30nM. Assay description: 2.5 μL of 10% DMSO or compound in 10% DMSO was added to the wells in a 96 well V-bottom plate. Optimized concentration of in-house Syk enzyme (d...
Ligand InfoPC cidPC sid
In DepthDetails US Patent
TargetTyrosine-protein kinase JAK2(Homo sapiens (Human))
Asan Biosciences
US Patent
LigandPNGBDBM322964(2-(azepan-1-yl)-4-((4-(methylsulfonyl) phenyl)amin...)
Affinity DataIC50: <10nM. Assay description: Two μL of 10% DMSO in blank, substrate control and positive control wells and 2 μL of test compound in test wells was added. Thirteen μ...
Ligand InfoPC cidPC sid
In DepthDetails US Patent