BDBM322971 5-tert-butyl-3-[(2-chlorophenyl)methyl]-7-(4-fluorophenyl)triazolo[4,5-d]pyrimidine::US10183946, Example 2
SMILES CC(C)(C)c1nc(-c2ccc(F)cc2)c2nnn(Cc3ccccc3Cl)c2n1
InChI Key InChIKey=GANYMYIVTXZASV-UHFFFAOYSA-N
Data  2 EC50
  Tab Delimited (TSV)   2D SDfile   Computed 3D by Vconf -m prep SDfile
Find this compound or compounds like it in BindingDB:
Activity Spreadsheet -- Enzyme Inhibition Constant Data from BindingDB
Found 2 hits for monomerid = 322971
TargetCannabinoid receptor 1(Homo sapiens (Human))
Hoffmann-La Roche
US Patent
LigandPNGBDBM322971(5-tert-butyl-3-[(2-chlorophenyl)methyl]-7-(4-fluor...)
Affinity DataEC50: >1.00E+4nM. Assay description: CHO cells expressing human CB1 or CB2 receptors are seeded 17-24 hours prior to the experiment 50.000 cells per well in a black 96 well plate with fl...
Ligand InfoPC cidPC sid
In DepthDetails US Patent
TargetCannabinoid receptor 2(Homo sapiens (Human))
Hoffmann-La Roche
US Patent
LigandPNGBDBM322971(5-tert-butyl-3-[(2-chlorophenyl)methyl]-7-(4-fluor...)
Affinity DataEC50:  28.5nM. Assay description: CHO cells expressing human CB1 or CB2 receptors are seeded 17-24 hours prior to the experiment 50.000 cells per well in a black 96 well plate with fl...
Ligand InfoPC cidPC sid
In DepthDetails US Patent