BDBM322998 7-(3-benzyltriazol-4-yl)-5-tert-butyl-3-[(1-methyltetrazol-5-yl)methyl]triazolo[4,5-d]pyrimidine::US10183946, Example 29
SMILES Cn1nnnc1Cn1nnc2c(nc(nc12)C(C)(C)C)-c1cnnn1Cc1ccccc1
InChI Key InChIKey=GWQPXSJJTHYWDK-UHFFFAOYSA-N
Data  2 EC50
  Tab Delimited (TSV)   2D SDfile   Computed 3D by Vconf -m prep SDfile
Find this compound or compounds like it in BindingDB:
Activity Spreadsheet -- Enzyme Inhibition Constant Data from BindingDB
Found 2 hits for monomerid = 322998
TargetCannabinoid receptor 1(Homo sapiens (Human))
Hoffmann-La Roche
US Patent
LigandPNGBDBM322998(7-(3-benzyltriazol-4-yl)-5-tert-butyl-3-[(1-methyl...)
Affinity DataEC50: >1.00E+4nM. Assay description: CHO cells expressing human CB1 or CB2 receptors are seeded 17-24 hours prior to the experiment 50.000 cells per well in a black 96 well plate with fl...
Ligand InfoPC cidPC sid
In DepthDetails US Patent
TargetCannabinoid receptor 2(Homo sapiens (Human))
Hoffmann-La Roche
US Patent
LigandPNGBDBM322998(7-(3-benzyltriazol-4-yl)-5-tert-butyl-3-[(1-methyl...)
Affinity DataEC50:  16.6nM. Assay description: CHO cells expressing human CB1 or CB2 receptors are seeded 17-24 hours prior to the experiment 50.000 cells per well in a black 96 well plate with fl...
Ligand InfoPC cidPC sid
In DepthDetails US Patent