BDBM323097 4-((trans-4-(4-chlorophenyl)-1-methylpiperidin-3-yl)methoxy)-2,5-difluoro-N-(1,2,4-thiadiazol-5-yl)benzenesulfonamide::US9630929, Example 70
SMILES CN1CCC([C@H](COc2cc(F)c(cc2F)S(=O)(=O)Nc2ncns2)C1)c1ccc(Cl)cc1
InChI Key InChIKey=LDZNFFGWKHAEMM-LBAUFKAWSA-N
Data  4 IC50
  Tab Delimited (TSV)   2D SDfile   Computed 3D by Vconf -m prep SDfile
Find this compound or compounds like it in BindingDB:
Activity Spreadsheet -- Enzyme Inhibition Constant Data from BindingDB
Found 4 hits for monomerid = 323097
TargetSodium channel protein type 9 subunit alpha(Homo sapiens (Human))
Xenon Pharmaceuticals
US Patent
LigandPNGBDBM323097(4-((trans-4-(4-chlorophenyl)-1-methylpiperidin-3-y...)
Affinity DataIC50: <100nM. Assay description: The following patch voltage clamp electrophysiology studies were performed on representative compounds of the invention using human embryonic kidney ...
Ligand InfoPC cidPC sid
In DepthDetails US Patent
TargetSodium channel protein type 5 subunit alpha(Homo sapiens (Human))
Xenon Pharmaceuticals
US Patent
LigandPNGBDBM323097(4-((trans-4-(4-chlorophenyl)-1-methylpiperidin-3-y...)
Affinity DataIC50: >1.00E+4nM. Assay description: The following patch voltage clamp electrophysiology studies were performed on representative compounds of the invention using human embryonic kidney ...
Ligand InfoPC cidPC sid
In DepthDetails US Patent
TargetSodium channel protein type 5 subunit alpha(Homo sapiens (Human))
Xenon Pharmaceuticals
US Patent
LigandPNGBDBM323097(4-((trans-4-(4-chlorophenyl)-1-methylpiperidin-3-y...)
Affinity DataIC50: >1.00E+4nM. Assay description: The following patch voltage clamp electrophysiology studies were performed on representative compounds of the invention using human embryonic kidney ...
Ligand InfoPC cidPC sid
In DepthDetails US Patent
TargetSodium channel protein type 9 subunit alpha(Homo sapiens (Human))
Xenon Pharmaceuticals
US Patent
LigandPNGBDBM323097(4-((trans-4-(4-chlorophenyl)-1-methylpiperidin-3-y...)
Affinity DataIC50:  12nM. Assay description: The following patch voltage clamp electrophysiology studies were performed on representative compounds of the invention using human embryonic kidney ...
Ligand InfoPC cidPC sid
In DepthDetails US Patent