BDBM323130 N-((4-((trans-4-(4-chlorophenyl)piperidin-3-yl)methoxy)-2,5-difluorophenyl)sulfonyl)benzamide::US9630929, Example 104
SMILES Fc1cc(c(F)cc1OC[C@@H]1CNCCC1c1ccc(Cl)cc1)S(=O)(=O)NC(=O)c1ccccc1
InChI Key InChIKey=RLJLEWLDIPDGDN-LROBGIAVSA-N
Data  1 IC50
  Tab Delimited (TSV)   2D SDfile   Computed 3D by Vconf -m prep SDfile
Find this compound or compounds like it in BindingDB:
Activity Spreadsheet -- Enzyme Inhibition Constant Data from BindingDB
Found 1 hit for monomerid = 323130
TargetSodium channel protein type 9 subunit alpha(Homo sapiens (Human))
Xenon Pharmaceuticals
US Patent
LigandPNGBDBM323130(N-((4-((trans-4-(4-chlorophenyl)piperidin-3-yl)met...)
Affinity DataIC50: >1.00E+4nM. Assay description: The following patch voltage clamp electrophysiology studies were performed on representative compounds of the invention using human embryonic kidney ...
Ligand InfoPC cidPC sid
In DepthDetails US Patent