BDBM323154 US9630931, Example 16
SMILES COc1cc(CCNC(=O)CN2CCOCC2)c(Cl)cc1NC(=O)Nc1cnc(cn1)C#N
InChI Key InChIKey=NHOLKCAPGBWLHF-UHFFFAOYSA-N
Data  1 IC50
  Tab Delimited (TSV)   2D SDfile   Computed 3D by Vconf -m prep SDfile
Find this compound or compounds like it in BindingDB:
Activity Spreadsheet -- Enzyme Inhibition Constant Data from BindingDB
Found 1 hit for monomerid = 323154
TargetSerine/threonine-protein kinase Chk1(Homo sapiens (Human))
Sentinel Oncology
US Patent
LigandPNGBDBM323154(US9630931, Example 16)
Affinity DataIC50:  76nM. Assay description: Reaction Buffer:Base Reaction buffer: 20 mM Hepes (pH 7.5), 10 mM MgCl2, 1 mM EGTA, 0.02% Brij35, 0.02 mg/ml BSA, 0.1 mM Na3VO4, 2 mM DTT, 1% DMSOReq...
Ligand InfoPC cidPC sid
In DepthDetails US Patent