BDBM323221 N-[(R)-2-oxo-2-(3-pentyl-3-phenylazetidin-1-yl)-1-(4-trifluoromethylbenzyl)ethyl]-3-(1H-imidazol-4-yl)propionamide::US9630949, 51
SMILES CCCCCC1(CN(C1)C(=O)[C@@H](Cc1ccc(cc1)C(F)(F)F)NC(=O)CCc1c[nH]cn1)c1ccccc1
InChI Key InChIKey=BZFXTUDHBJHVHA-AREMUKBSSA-N
Data  1 EC50
  Tab Delimited (TSV)   2D SDfile   Computed 3D by Vconf -m prep SDfile
Find this compound or compounds like it in BindingDB:
Activity Spreadsheet -- Enzyme Inhibition Constant Data from BindingDB
Found 1 hit for monomerid = 323221
TargetMelanocyte-stimulating hormone receptor(Homo sapiens (Human))
Galderma Research & Development
US Patent
LigandPNGBDBM323221(N-[(R)-2-oxo-2-(3-pentyl-3-phenylazetidin-1-yl)-1-...)
Affinity DataEC50:  1.00E+3nM. Assay description: In the presence of an activator (agonist), the melanocortin receptor will activate the cAMP pathway which, via the CRE-Luc vector, will result in the...
Ligand InfoPC cidPC sid
In DepthDetails US Patent