BDBM323226 N-[(R)-1-(3-fluorobenzyl)-2-oxo-2-(3-pentyl-3-phenylazetidin-1-yl)ethyl]-3-(1H-imidazol-4-yl)propionamide::US9630949, 56
SMILES CCCCCC1(CN(C1)C(=O)[C@@H](Cc1cccc(F)c1)NC(=O)CCc1c[nH]cn1)c1ccccc1
InChI Key InChIKey=NENDLSNDJLTHIZ-AREMUKBSSA-N
Data  2 EC50
  Tab Delimited (TSV)   2D SDfile   Computed 3D by Vconf -m prep SDfile
Find this compound or compounds like it in BindingDB:
Activity Spreadsheet -- Enzyme Inhibition Constant Data from BindingDB
Found 2 hits for monomerid = 323226
TargetMelanocortin receptor 4(Homo sapiens (Human))
Galderma Research & Development
US Patent
LigandPNGBDBM323226(N-[(R)-1-(3-fluorobenzyl)-2-oxo-2-(3-pentyl-3-phen...)
Affinity DataEC50:  8.00E+3nM. Assay description: In the presence of an activator (agonist), the melanocortin receptor will activate the cAMP pathway which, via the CRE-Luc vector, will result in the...
Ligand InfoPC cidPC sid
In DepthDetails US Patent
TargetMelanocyte-stimulating hormone receptor(Homo sapiens (Human))
Galderma Research & Development
US Patent
LigandPNGBDBM323226(N-[(R)-1-(3-fluorobenzyl)-2-oxo-2-(3-pentyl-3-phen...)
Affinity DataEC50:  4.00E+3nM. Assay description: In the presence of an activator (agonist), the melanocortin receptor will activate the cAMP pathway which, via the CRE-Luc vector, will result in the...
Ligand InfoPC cidPC sid
In DepthDetails US Patent