BDBM323229 US10189859, Compound 103
SMILES COCCOCCOCCN1CCN(CC1)c1nnc(c(N)n1)-c1cccc(Cl)c1Cl
InChI Key InChIKey=IKCMRKOHUDOPPJ-UHFFFAOYSA-N
Data  4 IC50
  Tab Delimited (TSV)   2D SDfile   Computed 3D by Vconf -m prep SDfile
Find this compound or compounds like it in BindingDB:
Activity Spreadsheet -- Enzyme Inhibition Constant Data from BindingDB
Found 4 hits for monomerid = 323229
TargetSodium channel protein type 9 subunit alpha(Homo sapiens (Human))
Nektar Therapeutics
US Patent
LigandPNGBDBM323229(US10189859, Compound 103)
Affinity DataIC50: >2.00E+5nM. Assay description: The potencies of the compounds provided herein to block specific Na+ channels was measured using automated patch clamp electrophysiologically of Nav1...
Ligand InfoPC cidPC sid
In DepthDetails US Patent
TargetSodium channel protein type 9 subunit alpha(Homo sapiens (Human))
Nektar Therapeutics
US Patent
LigandPNGBDBM323229(US10189859, Compound 103)
Affinity DataIC50: <5.00E+4nM. Assay description: The potencies of the compounds provided herein to block specific Na+ channels was measured using automated patch clamp electrophysiologically of Nav1...
Ligand InfoPC cidPC sid
In DepthDetails US Patent
TargetSodium channel protein type 9 subunit alpha(Homo sapiens (Human))
Nektar Therapeutics
US Patent
LigandPNGBDBM323229(US10189859, Compound 103)
Affinity DataIC50: >2.00E+5nM. Assay description: The potencies of the compounds provided herein to block specific Na+ channels was measured using automated patch clamp electrophysiologically of Nav1...
Ligand InfoPC cidPC sid
In DepthDetails US Patent
TargetSodium channel protein type 9 subunit alpha(Homo sapiens (Human))
Nektar Therapeutics
US Patent
LigandPNGBDBM323229(US10189859, Compound 103)
Affinity DataIC50:  5.49E+4nM. Assay description: The potencies of the compounds provided herein to block specific Na+ channels was measured using automated patch clamp electrophysiologically of Nav1...
Ligand InfoPC cidPC sid
In DepthDetails US Patent