BDBM323252 US9630945, 78
SMILES O=C(CCCc1c[nH]nn1)NC1CCN(CC1)C(=O)OCc1ccccc1
InChI Key InChIKey=PKKAQVQNIJRKCU-UHFFFAOYSA-N
Data  1 IC50
  Tab Delimited (TSV)   2D SDfile   Computed 3D by Vconf -m prep SDfile
Find this compound or compounds like it in BindingDB:
Activity Spreadsheet -- Enzyme Inhibition Constant Data from BindingDB
Found 1 hit for monomerid = 323252
TargetAtaxin-2(Homo sapiens (Human))
Novartis
US Patent
LigandPNGBDBM323252(US9630945, 78)
Affinity DataIC50:  1.39E+3nM. Assay description: ATX activity was determined by measurement of released choline in reactions containing ATX (10 nM), choline oxidase (0.1 U/ml), HRP (100 U/ml), ample...
Ligand InfoPC cidPC sid
In DepthDetails US Patent