BDBM323314 US9630956, Compound I-51
SMILES Nc1ncc(nc1-c1cc(no1)-c1ccc(CN2CCCC2)cc1)-c1ccc(=O)n(c1)C1CCCC1
InChI Key InChIKey=QJQLIFLGKWVTPC-UHFFFAOYSA-N
Data  1 KI
  Tab Delimited (TSV)   2D SDfile   Computed 3D by Vconf -m prep SDfile
Find this compound or compounds like it in BindingDB:
Activity Spreadsheet -- Enzyme Inhibition Constant Data from BindingDB
Found 1 hit for monomerid = 323314
TargetSerine/threonine-protein kinase ATR(Homo sapiens (Human))
Vertex Pharmaceuticals
US Patent
LigandPNGBDBM323314(US9630956, Compound I-51)
Affinity DataKi:  27.5nM. Assay description: Compounds were screened for their ability to inhibit ATR kinase using a radioactive-phosphate incorporation assay. Assays were carried out in a mixtu...
Ligand InfoPC cidPC sid
In DepthDetails US Patent