BDBM323362 US9630956, Compound I-99
SMILES CC(C#N)n1cc(ccc1=O)-c1cnc(N)c(n1)-c1cc(no1)-c1ccc(CNC2CC2)cc1
InChI Key InChIKey=RAHJCANRGAYYBC-UHFFFAOYSA-N
Data  1 KI
  Tab Delimited (TSV)   2D SDfile   Computed 3D by Vconf -m prep SDfile
Find this compound or compounds like it in BindingDB:
Activity Spreadsheet -- Enzyme Inhibition Constant Data from BindingDB
Found 1 hit for monomerid = 323362
TargetSerine/threonine-protein kinase ATR(Homo sapiens (Human))
Vertex Pharmaceuticals
US Patent
LigandPNGBDBM323362(US9630956, Compound I-99)
Affinity DataKi: <5nM. Assay description: Compounds were screened for their ability to inhibit ATR kinase using a radioactive-phosphate incorporation assay. Assays were carried out in a mixtu...
Ligand InfoPC cidPC sid
In DepthDetails US Patent