BDBM323373 US9630956, Compound I-110
SMILES CNCc1ccc(cc1)-c1cc(on1)-c1nc(cnc1N)C1=CCC(=O)[N](CCO)=C1
InChI Key InChIKey=XLTNCBMTUGDSMC-UHFFFAOYSA-N
Data  1 KI
  Tab Delimited (TSV)   2D SDfile   Computed 3D by Vconf -m prep SDfile
Find this compound or compounds like it in BindingDB:
Activity Spreadsheet -- Enzyme Inhibition Constant Data from BindingDB
Found 1 hit for monomerid = 323373
TargetSerine/threonine-protein kinase ATR(Homo sapiens (Human))
Vertex Pharmaceuticals
US Patent
LigandPNGBDBM323373(US9630956, Compound I-110)
Affinity DataKi: <5nM. Assay description: Compounds were screened for their ability to inhibit ATR kinase using a radioactive-phosphate incorporation assay. Assays were carried out in a mixtu...
Ligand InfoPC cidPC sid
In DepthDetails US Patent