BDBM323448 4-((3-(3-Amino-1-Hydroxypropyl)Phenoxy)Methyl)Heptan-4-Ol::US10188615, Example 20::US10639286, Example 20
SMILES CCCC(O)(CCC)COc1cccc(c1)C(O)CCN
InChI Key InChIKey=NLJSHOJXPLFAMP-UHFFFAOYSA-N
Data  4 IC50
  Tab Delimited (TSV)   2D SDfile   Computed 3D by Vconf -m prep SDfile
Find this compound or compounds like it in BindingDB:
Activity Spreadsheet -- Enzyme Inhibition Constant Data from BindingDB
Found 4 hits for monomerid = 323448
TargetRetinoid isomerohydrolase(Homo sapiens (Human))
Acucela
US Patent
LigandPNGBDBM323448(4-((3-(3-Amino-1-Hydroxypropyl)Phenoxy)Methyl)Hept...)
Affinity DataIC50:  55nM. Assay description: Isomerase inhibition reactions were performed essentially as described (Stecher et al., J. Biol. Chem. 274:8577-85 (1999); see also Golczak et al., P...
Ligand InfoPC cidPC sid
In DepthDetails US Patent
TargetRetinaldehyde-binding protein 1(Homo sapiens (Human))
Acucela
US Patent
LigandPNGBDBM323448(4-((3-(3-Amino-1-Hydroxypropyl)Phenoxy)Methyl)Hept...)
Affinity DataIC50:  55nM. Assay description: Isomerase inhibition reactions were performed essentially as described (Stecher et al., J Biol. Chem. 274:8577-85 (1999).
Ligand InfoPC cidPC sid
In DepthDetails US Patent
TargetRetinaldehyde-binding protein 1(Bovine)
Acucela
US Patent
LigandPNGBDBM323448(4-((3-(3-Amino-1-Hydroxypropyl)Phenoxy)Methyl)Hept...)
Affinity DataIC50: <100nM. Assay description: Isomerase inhibition reactions were performed essentially as described (Stecher et al., J Biol. Chem. 274:8577-85 (1999).
Ligand InfoPC cidPC sid
In DepthDetails US Patent
TargetRetinoid isomerohydrolase(Bos taurus (Bovine))
Acucela
US Patent
LigandPNGBDBM323448(4-((3-(3-Amino-1-Hydroxypropyl)Phenoxy)Methyl)Hept...)
Affinity DataIC50: <1.00E+3nM. Assay description: Isomerase inhibition reactions were performed essentially as described (Stecher et al., J. Biol. Chem. 274:8577-85 (1999); see also Golczak et al., P...
Ligand InfoPC cidPC sid
In DepthDetails US Patent