BDBM323468 3-Amino-1-(3-(2-Methoxybenzyloxy)Phenyl)Propan-1-Ol::US10188615, Example 92::US10639286, Example 92
SMILES COc1ccccc1COc1cccc(c1)C(O)CCN
InChI Key InChIKey=FQUTXAGYBOXJPP-UHFFFAOYSA-N
Data  2 IC50
  Tab Delimited (TSV)   2D SDfile   Computed 3D by Vconf -m prep SDfile
Find this compound or compounds like it in BindingDB:
Activity Spreadsheet -- Enzyme Inhibition Constant Data from BindingDB
Found 2 hits for monomerid = 323468
TargetRetinaldehyde-binding protein 1(Homo sapiens (Human))
Acucela
US Patent
LigandPNGBDBM323468(3-Amino-1-(3-(2-Methoxybenzyloxy)Phenyl)Propan-1-O...)
Affinity DataIC50:  55nM. Assay description: Isomerase inhibition reactions were performed essentially as described (Stecher et al., J Biol. Chem. 274:8577-85 (1999).
Ligand InfoPC cidPC sid
In DepthDetails US Patent
TargetRetinoid isomerohydrolase(Homo sapiens (Human))
Acucela
US Patent
LigandPNGBDBM323468(3-Amino-1-(3-(2-Methoxybenzyloxy)Phenyl)Propan-1-O...)
Affinity DataIC50:  55nM. Assay description: Isomerase inhibition reactions were performed essentially as described (Stecher et al., J. Biol. Chem. 274:8577-85 (1999); see also Golczak et al., P...
Ligand InfoPC cidPC sid
In DepthDetails US Patent