BDBM323526 2-(3-(3-Methoxypropoxy)Phenoxy)Ethanamine::US10188615, Example 85::US10639286, Example 85
SMILES COCCCOc1cccc(OCCN)c1
InChI Key InChIKey=POCNHEMUULPEIX-UHFFFAOYSA-N
Data  2 IC50
  Tab Delimited (TSV)   2D SDfile   Computed 3D by Vconf -m prep SDfile
Find this compound or compounds like it in BindingDB:
Activity Spreadsheet -- Enzyme Inhibition Constant Data from BindingDB
Found 2 hits for monomerid = 323526
TargetRetinaldehyde-binding protein 1(Homo sapiens (Human))
Acucela
US Patent
LigandPNGBDBM323526(2-(3-(3-Methoxypropoxy)Phenoxy)Ethanamine | US1018...)
Affinity DataIC50:  550nM. Assay description: Isomerase inhibition reactions were performed essentially as described (Stecher et al., J Biol. Chem. 274:8577-85 (1999).
Ligand InfoPC cidPC sid
In DepthDetails US Patent
TargetRetinoid isomerohydrolase(Homo sapiens (Human))
Acucela
US Patent
LigandPNGBDBM323526(2-(3-(3-Methoxypropoxy)Phenoxy)Ethanamine | US1018...)
Affinity DataIC50:  550nM. Assay description: Isomerase inhibition reactions were performed essentially as described (Stecher et al., J. Biol. Chem. 274:8577-85 (1999); see also Golczak et al., P...
Ligand InfoPC cidPC sid
In DepthDetails US Patent