BDBM323559 3-(3-(2-Methoxyethoxy)Phenyl)Propan-1-Amine::US10188615, Example 40::US10639286, Example 40
SMILES COCCOc1cccc(CCCN)c1
InChI Key InChIKey=BROCWGNTDSNSLD-UHFFFAOYSA-N
Data  2 IC50
  Tab Delimited (TSV)   2D SDfile   Computed 3D by Vconf -m prep SDfile
Find this compound or compounds like it in BindingDB:
Activity Spreadsheet -- Enzyme Inhibition Constant Data from BindingDB
Found 2 hits for monomerid = 323559
TargetRetinaldehyde-binding protein 1(Homo sapiens (Human))
Acucela
US Patent
LigandPNGBDBM323559(3-(3-(2-Methoxyethoxy)Phenyl)Propan-1-Amine | US10...)
Affinity DataIC50:  5.50E+3nM. Assay description: Isomerase inhibition reactions were performed essentially as described (Stecher et al., J Biol. Chem. 274:8577-85 (1999).
Ligand InfoPC cidPC sid
In DepthDetails US Patent
TargetRetinoid isomerohydrolase(Homo sapiens (Human))
Acucela
US Patent
LigandPNGBDBM323559(3-(3-(2-Methoxyethoxy)Phenyl)Propan-1-Amine | US10...)
Affinity DataIC50:  5.50E+3nM. Assay description: Isomerase inhibition reactions were performed essentially as described (Stecher et al., J. Biol. Chem. 274:8577-85 (1999); see also Golczak et al., P...
Ligand InfoPC cidPC sid
In DepthDetails US Patent