BDBM323614 6-(2-((N,2-dimethylbenzofuran-5-carboxamido)methyl)phenoxy)-2,2-dimethylhexanoic acid ::US10188627, Compound 8z
SMILES CN(Cc1ccccc1OCCCCC(C)(C)C(O)=O)C(=O)c1ccc2oc(C)cc2c1
InChI Key InChIKey=AIZRABWDUBYVKD-UHFFFAOYSA-N
Data  1 EC50
  Tab Delimited (TSV)   2D SDfile   Computed 3D by Vconf -m prep SDfile
Find this compound or compounds like it in BindingDB:
Activity Spreadsheet -- Enzyme Inhibition Constant Data from BindingDB
Found 1 hit for monomerid = 323614
TargetPeroxisome proliferator-activated receptor delta(Homo sapiens (Human))
Mitobridge
US Patent
LigandPNGBDBM323614(6-(2-((N,2-dimethylbenzofuran-5-carboxamido)methyl...)
Affinity DataEC50:  5.54E+3nM. Assay description: Medium including test compound was aspirated and washed with PBS. 50 μl PBS including 1 mM Mg++ and Ca++ were then added to each well. The lucif...
Ligand InfoPC cidPC sid
In DepthDetails US Patent