BDBM323758 4-({[6-Bromo-3-(difluoromethyl)-2-phenylquinolin-4-yl]carbonyl}amino)-3-fluorobenzoic acid::US10189788, Example 38
SMILES OC(=O)c1ccc(NC(=O)c2c(C(F)F)c(nc3ccc(Br)cc23)-c2ccccc2)c(F)c1
InChI Key InChIKey=FNNSJNRRZJYBLZ-UHFFFAOYSA-N
Data  1 IC50
  Tab Delimited (TSV)   2D SDfile   Computed 3D by Vconf -m prep SDfile
Find this compound or compounds like it in BindingDB:
Activity Spreadsheet -- Enzyme Inhibition Constant Data from BindingDB
Found 1 hit for monomerid = 323758
TargetProstaglandin F2-alpha receptor(Homo sapiens (Human))
Bayer Pharma Aktiengesellschaft
US Patent
LigandPNGBDBM323758(4-({[6-Bromo-3-(difluoromethyl)-2-phenylquinolin-4...)
Affinity DataIC50:  265nM. Assay description: For the characterization of test substances in respect of FP antagonism, PGF2α-induced calcium flux in FP-expressing CHEM1 cells (Millipore, HTS...
Ligand InfoPC cidPC sid
In DepthDetails US Patent