BDBM323874 US10189809, Compound I-267
SMILES Fc1ccccc1Cn1nc(cc1-c1ccon1)-c1ncc(F)c(S)n1
InChI Key InChIKey=BADHGSPYVJGAIN-UHFFFAOYSA-N
Data  1 EC50
  Tab Delimited (TSV)   2D SDfile   Computed 3D by Vconf -m prep SDfile
Find this compound or compounds like it in BindingDB:
Activity Spreadsheet -- Enzyme Inhibition Constant Data from BindingDB
Found 1 hit for monomerid = 323874
TargetGuanylate cyclase soluble subunit alpha-1(Homo sapiens (Human))
Ironwood Pharmaceuticals
US Patent
LigandPNGBDBM323874(US10189809, Compound I-267)
Affinity DataEC50: <2.00E+4nM. Assay description: Human embryonic kidney cells (HEK293), endogenously expressing soluble guanylate cyclase (sGC), were used to evaluate the activity of test compounds....
Ligand InfoPC cidPC sid
In DepthDetails US Patent