BDBM323903 US10189809, Compound I-234
SMILES CN(C(=O)C(C)(C)C)c1cnc(nc1N)-c1cc(-c2ccon2)n(Cc2ccccc2F)n1
InChI Key InChIKey=SJWFWFRQNSWQFF-UHFFFAOYSA-N
Data  1 EC50
  Tab Delimited (TSV)   2D SDfile   Computed 3D by Vconf -m prep SDfile
Find this compound or compounds like it in BindingDB:
Activity Spreadsheet -- Enzyme Inhibition Constant Data from BindingDB
Found 1 hit for monomerid = 323903
TargetGuanylate cyclase soluble subunit alpha-1(Homo sapiens (Human))
Ironwood Pharmaceuticals
US Patent
LigandPNGBDBM323903(US10189809, Compound I-234)
Affinity DataEC50: <2.00E+4nM. Assay description: Human embryonic kidney cells (HEK293), endogenously expressing soluble guanylate cyclase (sGC), were used to evaluate the activity of test compounds....
Ligand InfoPC cidPC sid
In DepthDetails US Patent