BDBM324045 US10189816, Compound 38
SMILES Cc1nc(C)c(-c2ccc3CN(Cc4cc(F)ccc4F)CCc3c2)c(N2CCC(C)(C)CC2)c1[C@H](OC(C)(C)C)C(O)=O
InChI Key InChIKey=GGHBGKQUWYTGBW-XIFFEERXSA-N
Data  2 EC50
  Tab Delimited (TSV)   2D SDfile   Computed 3D by Vconf -m prep SDfile
Find this compound or compounds like it in BindingDB:
Activity Spreadsheet -- Enzyme Inhibition Constant Data from BindingDB
Found 2 hits for monomerid = 324045
TargetEnvelope glycoprotein gp160(Human immunodeficiency virus type 1 group M subtyp...)
Viiv Healthcare UK (NO.5)
US Patent
LigandPNGBDBM324045(US10189816, Compound 38)
Affinity DataEC50:  6nM. Assay description: A recombinant NL-RLuc proviral clone was constructed in which a section of the nef gene from NL4-3 was replaced with the Renilla Luciferase gene. Thi...
Ligand InfoPC cidPC sid
In DepthDetails US Patent
TargetEnvelope glycoprotein gp160(Human immunodeficiency virus type 1 group M subtyp...)
Viiv Healthcare UK (NO.5)
US Patent
LigandPNGBDBM324045(US10189816, Compound 38)
Affinity DataEC50: <100nM. Assay description: A recombinant NL-RLuc proviral clone was constructed in which a section of the nef gene from NL4-3 was replaced with the Renilla Luciferase gene. Thi...
Ligand InfoPC cidPC sid
In DepthDetails US Patent