BDBM324090 US10189816, Compound 83
SMILES COc1cc(F)c(CN2CCc3cc(ccc3C2)-c2c(C)nc(C)c([C@H](OC(C)(C)C)C(O)=O)c2N2CCC(C)(C)CC2)cc1F
InChI Key InChIKey=UOYRETYCLZDQTB-UMSFTDKQSA-N
Data  1 EC50
  Tab Delimited (TSV)   2D SDfile   Computed 3D by Vconf -m prep SDfile
Find this compound or compounds like it in BindingDB:
Activity Spreadsheet -- Enzyme Inhibition Constant Data from BindingDB
Found 1 hit for monomerid = 324090
TargetEnvelope glycoprotein gp160(Human immunodeficiency virus type 1 group M subtyp...)
Viiv Healthcare UK (NO.5)
US Patent
LigandPNGBDBM324090(US10189816, Compound 83)
Affinity DataEC50: <100nM. Assay description: A recombinant NL-RLuc proviral clone was constructed in which a section of the nef gene from NL4-3 was replaced with the Renilla Luciferase gene. Thi...
Ligand InfoPC cidPC sid
In DepthDetails US Patent