BDBM324110 US10189816, Compound 103
SMILES CCOc1cccc(CN2CCc3cc(ccc3C2)-c2c(C)nc(C)c([C@H](OC(C)(C)C)C(O)=O)c2N2CCC(C)(C)CC2)c1
InChI Key InChIKey=GNSFVIQYQZZJOP-DHUJRADRSA-N
Data  2 EC50
  Tab Delimited (TSV)   2D SDfile   Computed 3D by Vconf -m prep SDfile
Find this compound or compounds like it in BindingDB:
Activity Spreadsheet -- Enzyme Inhibition Constant Data from BindingDB
Found 2 hits for monomerid = 324110
TargetEnvelope glycoprotein gp160(Human immunodeficiency virus type 1 group M subtyp...)
Viiv Healthcare UK (NO.5)
US Patent
LigandPNGBDBM324110(US10189816, Compound 103)
Affinity DataEC50:  12nM. Assay description: A recombinant NL-RLuc proviral clone was constructed in which a section of the nef gene from NL4-3 was replaced with the Renilla Luciferase gene. Thi...
Ligand InfoPC cidPC sid
In DepthDetails US Patent
TargetEnvelope glycoprotein gp160(Human immunodeficiency virus type 1 group M subtyp...)
Viiv Healthcare UK (NO.5)
US Patent
LigandPNGBDBM324110(US10189816, Compound 103)
Affinity DataEC50: <100nM. Assay description: A recombinant NL-RLuc proviral clone was constructed in which a section of the nef gene from NL4-3 was replaced with the Renilla Luciferase gene. Thi...
Ligand InfoPC cidPC sid
In DepthDetails US Patent