BDBM32412 furan-2-carboxamide deriv., 24
SMILES CNC(=O)[C@@H](NC(=O)c1ccc(o1)-c1ccc(OCc2cc3ccccc3o2)cn1)C1CCCCC1
InChI Key InChIKey=QFTBNNVRPZGDJF-SANMLTNESA-N
Data  1 IC50
  Tab Delimited (TSV)   2D SDfile   Computed 3D by Vconf -m prep SDfile
Find this compound or compounds like it in BindingDB:
Activity Spreadsheet -- Enzyme Inhibition Constant Data from BindingDB
Found 1 hit for monomerid = 32412
TargetCollagenase 3(Homo sapiens (Human))
Boehringer Ingelheim Pharmaceuticals
LigandPNGBDBM32412(furan-2-carboxamide deriv., 24)
Affinity DataIC50:  6nMpH: 7.5 T: 2°C. Assay description: MMP-13 was assessed by using the EnzoLyte 520 Generic MMP Assay Kit (AnaSpec Inc.). This kit uses a 5-FAM/QXL 520 fluorescence resonance 10 energy tr...
In DepthDetails ArticlePubMed