BDBM324131 US10189816, Compound 124
SMILES COc1ccc(F)cc1CN1CCc2cc(ccc2C1)-c1c(C)nc(C)c([C@H](OC(C)(C)C)C(O)=O)c1N1CCC(C)(C)CC1
InChI Key InChIKey=FSPVYDHUDJUFND-UMSFTDKQSA-N
Data  1 EC50
  Tab Delimited (TSV)   2D SDfile   Computed 3D by Vconf -m prep SDfile
Find this compound or compounds like it in BindingDB:
Activity Spreadsheet -- Enzyme Inhibition Constant Data from BindingDB
Found 1 hit for monomerid = 324131
TargetEnvelope glycoprotein gp160(Human immunodeficiency virus type 1 group M subtyp...)
Viiv Healthcare UK (NO.5)
US Patent
LigandPNGBDBM324131(US10189816, Compound 124)
Affinity DataEC50: <100nM. Assay description: A recombinant NL-RLuc proviral clone was constructed in which a section of the nef gene from NL4-3 was replaced with the Renilla Luciferase gene. Thi...
Ligand InfoPC cidPC sid
In DepthDetails US Patent