BDBM324186 US10189819, Example 15
SMILES Cc1nncn1-c1ccc(C(=O)NCC(c2nc3c(C)cc(Cl)cc3[nH]2)c2cccc(F)c2)c(Cl)c1
InChI Key
Data  1 IC50
  Tab Delimited (TSV)   2D SDfile   Computed 3D by Vconf -m prep SDfile
Find this compound or compounds like it in BindingDB:
Activity Spreadsheet -- Enzyme Inhibition Constant Data from BindingDB
Found 1 hit for monomerid = 324186
TargetCoagulation factor IX(Homo sapiens (Human))
Merck Sharp & Dohme
US Patent
LigandPNGBDBM324186(US10189819, Example 15)
Affinity DataIC50:  4.90nM. Assay description: Formation of a clot to stem bleeding at a site of blood vessel injury involves the coordinated activity of a group of plasma proteins that initiate a...
Ligand InfoPC cidPC sid
In DepthDetails US Patent