BDBM324214 US10189819, Example 51
SMILES Cc1cc2nc([nH]c2cc1C)C(CNC(=O)c1ccc(cc1Cl)-n1cnnc1)c1ccccc1F
InChI Key
Data  1 IC50
  Tab Delimited (TSV)   2D SDfile   Computed 3D by Vconf -m prep SDfile
Find this compound or compounds like it in BindingDB:
Activity Spreadsheet -- Enzyme Inhibition Constant Data from BindingDB
Found 1 hit for monomerid = 324214
TargetCoagulation factor IX(Homo sapiens (Human))
Merck Sharp & Dohme
US Patent
LigandPNGBDBM324214(US10189819, Example 51)
Affinity DataIC50:  19.3nM. Assay description: Formation of a clot to stem bleeding at a site of blood vessel injury involves the coordinated activity of a group of plasma proteins that initiate a...
Ligand InfoPC cidPC sid
In DepthDetails US Patent