BDBM324238 US10189819, Example 81
SMILES Cc1ncn(n1)-c1cc(Cl)c(C(=O)NCC(c2cccc(F)c2)c2cc3nc(C)[nH]c3cn2)c(Cl)c1
InChI Key
Data  1 IC50
  Tab Delimited (TSV)   2D SDfile   Computed 3D by Vconf -m prep SDfile
Find this compound or compounds like it in BindingDB:
Activity Spreadsheet -- Enzyme Inhibition Constant Data from BindingDB
Found 1 hit for monomerid = 324238
TargetCoagulation factor IX(Homo sapiens (Human))
Merck Sharp & Dohme
US Patent
LigandPNGBDBM324238(US10189819, Example 81)
Affinity DataIC50:  126nM. Assay description: Formation of a clot to stem bleeding at a site of blood vessel injury involves the coordinated activity of a group of plasma proteins that initiate a...
Ligand InfoPC cidPC sid
In DepthDetails US Patent