BDBM324291 (R)—N-(2-(2-((1-methyl-1H-pyrazol-4-yl)amino)pyrimidin-4-yl)-6,7,8,9-tetrahydro-5H-benzo[7]annulen-5-yl)-5-(1-methylcyclopropyl)-1,2,4-oxadiazole-3-carboxamide ::US10189829, Compound 34::US10227341, Compound 34::US10961237, Compound 34::US11858926, Compound 34
SMILES Cn1cc(Nc2nccc(n2)-c2ccc3[C@@H](CCCCc3c2)NC(=O)c2noc(n2)C2(C)CC2)cn1
InChI Key InChIKey=BMLRHHRIOTUXSP-OAQYLSRUSA-N
Data  4 IC50
  Tab Delimited (TSV)   2D SDfile   Computed 3D by Vconf -m prep SDfile
Find this compound or compounds like it in BindingDB:
Activity Spreadsheet -- Enzyme Inhibition Constant Data from BindingDB
Found 4 hits for monomerid = 324291
TargetTyrosine-protein kinase BTK(Homo sapiens (Human))
Biogen Ma
US Patent
LigandPNGBDBM324291((R)—N-(2-(2-((1-methyl-1H-pyrazol-4-yl)amino)...)
Affinity DataIC50: <1nM. Assay description: The purpose of the BTK in vitro assay is to determine compound potency against BTK through the measurement of IC50. Compound inhibition is measured a...
Ligand InfoPC cidPC sid
In DepthDetails US Patent
TargetTyrosine-protein kinase BTK [14-552](Homo sapiens (Human))
Biogen Ma
US Patent
LigandPNGBDBM324291((R)—N-(2-(2-((1-methyl-1H-pyrazol-4-yl)amino)...)
Affinity DataIC50: <1nM. Assay description: The purpose of the BTK in vitro assay is to determine compound potency against BTK through the measurement of IC50. Compound inhibition is measured a...
Ligand InfoPC cidPC sid
In DepthDetails US Patent
TargetTyrosine-protein kinase BTK(Homo sapiens (Human))
Biogen Ma
US Patent
LigandPNGBDBM324291((R)—N-(2-(2-((1-methyl-1H-pyrazol-4-yl)amino)...)
Affinity DataIC50: <1nM. Assay description: The purpose of the BTK in vitro assay is to determine compound potency against BTK through the measurement of IC50. Compound inhibition is measured a...
Ligand InfoPC cidPC sid
In DepthDetails US Patent
TargetTyrosine-protein kinase BTK(Homo sapiens (Human))
Biogen Ma
US Patent
LigandPNGBDBM324291((R)—N-(2-(2-((1-methyl-1H-pyrazol-4-yl)amino)...)
Affinity DataIC50:  505nM. Assay description: The purpose of the BTK in vitro assay is to determine compound potency against BTK through the measurement of IC50. Compound inhibition is measured a...
Ligand InfoPC cidPC sid
In DepthDetails US Patent