BDBM324334 (R)-1-(tert-butyl)-N-(2- (2-hydroxyethyl)-8-(2- ((1-isopropyl-1H- pyrazol-4- yl)amino)pyrimidin-4- yl)-2,3,4,5-tetrahydro- 1H-benzo[c]azepin- 5-yl)- 1H-1,2,3-triazole-4- carboxamide::US10189829, Compound 105::US10227341, Compound 105::US10961237, Compound 105::US11858926, Compound 105
SMILES CC(C)n1cc(Nc2nccc(n2)-c2ccc3[C@@H](CCN(CCO)Cc3c2)NC(=O)c2cn(nn2)C(C)(C)C)cn1
InChI Key InChIKey=PKSHWAKTGPMVQY-RUZDIDTESA-N
Data  4 IC50
  Tab Delimited (TSV)   2D SDfile   Computed 3D by Vconf -m prep SDfile
Find this compound or compounds like it in BindingDB:
Activity Spreadsheet -- Enzyme Inhibition Constant Data from BindingDB
Found 4 hits for monomerid = 324334
TargetTyrosine-protein kinase BTK(Homo sapiens (Human))
Biogen Ma
US Patent
LigandPNGBDBM324334((R)-1-(tert-butyl)-N-(2- (2-hydroxyethyl)-8-(2- ((...)
Affinity DataIC50: <1nM. Assay description: The purpose of the BTK in vitro assay is to determine compound potency against BTK through the measurement of IC50. Compound inhibition is measured a...
Ligand InfoPC cidPC sid
In DepthDetails US Patent
TargetTyrosine-protein kinase BTK [14-552](Homo sapiens (Human))
Biogen Ma
US Patent
LigandPNGBDBM324334((R)-1-(tert-butyl)-N-(2- (2-hydroxyethyl)-8-(2- ((...)
Affinity DataIC50: <1nM. Assay description: The purpose of the BTK in vitro assay is to determine compound potency against BTK through the measurement of IC50. Compound inhibition is measured a...
Ligand InfoPC cidPC sid
In DepthDetails US Patent
TargetTyrosine-protein kinase BTK(Homo sapiens (Human))
Biogen Ma
US Patent
LigandPNGBDBM324334((R)-1-(tert-butyl)-N-(2- (2-hydroxyethyl)-8-(2- ((...)
Affinity DataIC50: <1nM. Assay description: The purpose of the BTK in vitro assay is to determine compound potency against BTK through the measurement of IC50. Compound inhibition is measured a...
Ligand InfoPC cidPC sid
In DepthDetails US Patent
TargetTyrosine-protein kinase BTK(Homo sapiens (Human))
Biogen Ma
US Patent
LigandPNGBDBM324334((R)-1-(tert-butyl)-N-(2- (2-hydroxyethyl)-8-(2- ((...)
Affinity DataIC50:  505nM. Assay description: The purpose of the BTK in vitro assay is to determine compound potency against BTK through the measurement of IC50. Compound inhibition is measured a...
Ligand InfoPC cidPC sid
In DepthDetails US Patent