BDBM32435 Benzo[c][2,7]naphthyridine, 28
SMILES COc1cc2ncc3c(N)nc(cc3c2cc1OC)-c1cncc(N)c1
InChI Key InChIKey=SSLJECKHDGCAMK-UHFFFAOYSA-N
Data  1 IC50
  Tab Delimited (TSV)   2D SDfile   Computed 3D by Vconf -m prep SDfile
Find this compound or compounds like it in BindingDB:
Activity Spreadsheet -- Enzyme Inhibition Constant Data from BindingDB
Found 1 hit for monomerid = 32435
Target3-phosphoinositide-dependent protein kinase 1 [48-359](Homo sapiens (Human))
Wyeth Research
LigandPNGBDBM32435(Benzo[c][2,7]naphthyridine, 28)
Affinity DataIC50:  26nMpH: 7.4 T: 2°C. Assay description: A homogeneous in vitro assay based on a LANCE format was first used for high-throughput screening. Those compounds that showed the largest differenti...
In DepthDetails ArticlePubMed