BDBM324398 (S)-5-(tert-butyl)-N-(8- (2-((1-methyl-1H- pyrazol-4- yl)amino)pyrimidin-4- yl)-2-(2,2,2- trifluoroethyl)-2,3,4,5- tetrahydro-1H- benzo[c]azepin-5-yl)- 1,2,4-oxadiazole-3- carboxamide::US10189829, Compound 137::US10227341, Compound 137::US10961237, Compound 137::US11858926, Compound 137
SMILES Cn1cc(Nc2nccc(n2)-c2ccc3[C@H](CCN(CC(F)(F)F)Cc3c2)NC(=O)c2noc(n2)C(C)(C)C)cn1
InChI Key InChIKey=VRTAYDQHUDIICQ-NRFANRHFSA-N
Data  4 IC50
  Tab Delimited (TSV)   2D SDfile   Computed 3D by Vconf -m prep SDfile
Find this compound or compounds like it in BindingDB:
Activity Spreadsheet -- Enzyme Inhibition Constant Data from BindingDB
Found 4 hits for monomerid = 324398
TargetTyrosine-protein kinase BTK(Homo sapiens (Human))
Biogen Ma
US Patent
LigandPNGBDBM324398((S)-5-(tert-butyl)-N-(8- (2-((1-methyl-1H- pyrazol...)
Affinity DataIC50:  505nM. Assay description: The purpose of the BTK in vitro assay is to determine compound potency against BTK through the measurement of IC50. Compound inhibition is measured a...
Ligand InfoPC cidPC sid
In DepthDetails US Patent
TargetTyrosine-protein kinase BTK [14-552](Homo sapiens (Human))
Biogen Ma
US Patent
LigandPNGBDBM324398((S)-5-(tert-butyl)-N-(8- (2-((1-methyl-1H- pyrazol...)
Affinity DataIC50:  505nM. Assay description: The purpose of the BTK in vitro assay is to determine compound potency against BTK through the measurement of IC50. Compound inhibition is measured a...
Ligand InfoPC cidPC sid
In DepthDetails US Patent
TargetTyrosine-protein kinase BTK(Homo sapiens (Human))
Biogen Ma
US Patent
LigandPNGBDBM324398((S)-5-(tert-butyl)-N-(8- (2-((1-methyl-1H- pyrazol...)
Affinity DataIC50:  505nM. Assay description: The purpose of the BTK in vitro assay is to determine compound potency against BTK through the measurement of IC50. Compound inhibition is measured a...
Ligand InfoPC cidPC sid
In DepthDetails US Patent
TargetTyrosine-protein kinase BTK(Homo sapiens (Human))
Biogen Ma
US Patent
LigandPNGBDBM324398((S)-5-(tert-butyl)-N-(8- (2-((1-methyl-1H- pyrazol...)
Affinity DataIC50: <1nM. Assay description: The purpose of the BTK in vitro assay is to determine compound potency against BTK through the measurement of IC50. Compound inhibition is measured a...
Ligand InfoPC cidPC sid
In DepthDetails US Patent