BDBM324626 1-(4-methylpiperazin-1- yl)-2-[4-[[8-[rac-(1S,5R)- 8-(4-pyridylmethoxy)-3- azabicyclo[3.2.1]octan-3- yl]-[1,2,4]triazolo[1,5-a] pyridin-2- yl]amino]pyrazol-1- yl]ethanone::US10189836, Example 189
SMILES CN1CCN(CC1)C(=O)Cn1cc(Nc2nc3c(cccn3n2)N2C[C@@H]3CC[C@H](C2)[C@H]3OCc2ccncc2)cn1
InChI Key InChIKey=QBTDQBIAFIMTFP-JBNMYPGFSA-N
Data  2 KI
  Tab Delimited (TSV)   2D SDfile   Computed 3D by Vconf -m prep SDfile
Find this compound or compounds like it in BindingDB:
Activity Spreadsheet -- Enzyme Inhibition Constant Data from BindingDB
Found 2 hits for monomerid = 324626
TargetTyrosine-protein kinase JAK2(Homo sapiens (Human))
Genentech
US Patent
LigandPNGBDBM324626(1-(4-methylpiperazin-1- yl)-2-[4-[[8-[rac-(1S,5R)-...)
Affinity DataKi:  0.300nM. Assay description: The activity of the isolated recombinant JAK1 and JAK2 kinase domain was measured by monitoring phosphorylation of a peptide derived from JAK3 (Val-A...
Ligand InfoPC cidPC sid
In DepthDetails US Patent
TargetTyrosine-protein kinase JAK1(Homo sapiens (Human))
Genentech
US Patent
LigandPNGBDBM324626(1-(4-methylpiperazin-1- yl)-2-[4-[[8-[rac-(1S,5R)-...)
Affinity DataKi:  0.5nM. Assay description: The activity of the isolated recombinant JAK1 and JAK2 kinase domain was measured by monitoring phosphorylation of a peptide derived from JAK3 (Val-A...
Ligand InfoPC cidPC sid
In DepthDetails US Patent