BDBM324647 1'-({5,6-Difluoro-1-[2- (methylsulfonyl)ethyl]-1H-indol-2- yl}methyl)spiro[cyclopropane-1,3'- pyrrolo[2,3-c]pyridin]-2'(1'H)-one::US10189838, Example 1-11
SMILES CS(=O)(=O)CCn1c(CN2C(=O)C3(CC3)c3ccncc23)cc2cc(F)c(F)cc12
InChI Key InChIKey=IDXMOVWQGOWAQD-UHFFFAOYSA-N
Data  1 EC50
  Tab Delimited (TSV)   2D SDfile   Computed 3D by Vconf -m prep SDfile
Find this compound or compounds like it in BindingDB:
Activity Spreadsheet -- Enzyme Inhibition Constant Data from BindingDB
Found 1 hit for monomerid = 324647
TargetProtein M2-1(Human respiratory syncytial virus A (strain A2))
Hoffmann-La Roche
US Patent
LigandPNGBDBM324647(1'-({5,6-Difluoro-1-[2- (methylsulfonyl)ethyl]-1H-...)
Affinity DataEC50:  935nM. Assay description: To measure anti-RSV activity of compounds, 96-well plates are seeded with 6×103 cells per well in Dulbecco's modified Eagle's medium (DMEM) c...
Ligand InfoPC cidPC sid
In DepthDetails US Patent