BDBM324677 1'-({5-Chloro-1-[3- (methylsulfonyl)propyl]-1H- pyrrolo[3,2-b]pyridin-2- yl}methyl)spiro[cyclopropane-1,3'- pyrrolo[2,3-c]pyridin]-2'(1'H)-one::US10189838, Example 4-15
SMILES CS(=O)(=O)CCCn1c(CN2C(=O)C3(CC3)c3ccncc23)cc2nc(Cl)ccc12
InChI Key InChIKey=GGNSWZYJYJUHEZ-UHFFFAOYSA-N
Data  1 EC50
  Tab Delimited (TSV)   2D SDfile   Computed 3D by Vconf -m prep SDfile
Find this compound or compounds like it in BindingDB:
Activity Spreadsheet -- Enzyme Inhibition Constant Data from BindingDB
Found 1 hit for monomerid = 324677
TargetProtein M2-1(Human respiratory syncytial virus A (strain A2))
Hoffmann-La Roche
US Patent
LigandPNGBDBM324677(1'-({5-Chloro-1-[3- (methylsulfonyl)propyl]-1H- py...)
Affinity DataEC50:  18nM. Assay description: To measure anti-RSV activity of compounds, 96-well plates are seeded with 6×103 cells per well in Dulbecco's modified Eagle's medium (DMEM) c...
Ligand InfoPC cidPC sid
In DepthDetails US Patent