BDBM324683 3-{5-Chloro-2-[(2'- oxospiro[cyclopropane-1,3'- pyrrolo[2,3-c]pyridin]-1'(2'H)- yl)methyl]-1H-pyrrolo[2,3-b]pyridin- 1-yl}-N,N-dimethylpropane-1- sulfonamide::US10189838, Example 7-2
SMILES CN(C)S(=O)(=O)CCCn1c(CN2C(=O)C3(CC3)c3ccncc23)cc2cc(Cl)cnc12
InChI Key InChIKey=QBVHYHXVCZBBHG-UHFFFAOYSA-N
Data  1 EC50
  Tab Delimited (TSV)   2D SDfile   Computed 3D by Vconf -m prep SDfile
Find this compound or compounds like it in BindingDB:
Activity Spreadsheet -- Enzyme Inhibition Constant Data from BindingDB
Found 1 hit for monomerid = 324683
TargetProtein M2-1(Human respiratory syncytial virus A (strain A2))
Hoffmann-La Roche
US Patent
LigandPNGBDBM324683(3-{5-Chloro-2-[(2'- oxospiro[cyclopropane-1,3'- py...)
Affinity DataEC50:  64nM. Assay description: To measure anti-RSV activity of compounds, 96-well plates are seeded with 6×103 cells per well in Dulbecco's modified Eagle's medium (DMEM) c...
Ligand InfoPC cidPC sid
In DepthDetails US Patent