BDBM324695 Ethyl 3-{5-chloro-2-[(2'- oxospiro[cyclopropane-1,3'- pyrrolo[2,3-c]pyridin]-1'(2'H)- yl)methyl]-1H-indol-1-yl}propanoate::US10189838, Example 11
SMILES CCOC(=O)CCn1c(CN2C(=O)C3(CC3)c3ccncc23)cc2cc(Cl)ccc12
InChI Key InChIKey=BRCZVIFDLLPHAO-UHFFFAOYSA-N
Data  1 EC50
  Tab Delimited (TSV)   2D SDfile   Computed 3D by Vconf -m prep SDfile
Find this compound or compounds like it in BindingDB:
Activity Spreadsheet -- Enzyme Inhibition Constant Data from BindingDB
Found 1 hit for monomerid = 324695
TargetProtein M2-1(Human respiratory syncytial virus A (strain A2))
Hoffmann-La Roche
US Patent
LigandPNGBDBM324695(Ethyl 3-{5-chloro-2-[(2'- oxospiro[cyclopropane-1,...)
Affinity DataEC50:  19nM. Assay description: To measure anti-RSV activity of compounds, 96-well plates are seeded with 6×103 cells per well in Dulbecco's modified Eagle's medium (DMEM) c...
Ligand InfoPC cidPC sid
In DepthDetails US Patent