BDBM324741 4'-Chloro-1'-({5-chloro-1-[2- (methylsulfonyl)ethyl]-1H- benzimidazol-2- yl}methyl)spiro[cyclopropane-1,3'- indol]-2'(1'H)-one::US10189838, Example 34-3
SMILES CS(=O)(=O)CCn1c(CN2C(=O)C3(CC3)c3c2cccc3Cl)nc2cc(Cl)ccc12
InChI Key InChIKey=AMSILZBNVQNEOH-UHFFFAOYSA-N
Data  1 EC50
  Tab Delimited (TSV)   2D SDfile   Computed 3D by Vconf -m prep SDfile
Find this compound or compounds like it in BindingDB:
Activity Spreadsheet -- Enzyme Inhibition Constant Data from BindingDB
Found 1 hit for monomerid = 324741
TargetProtein M2-1(Human respiratory syncytial virus A (strain A2))
Hoffmann-La Roche
US Patent
LigandPNGBDBM324741(4'-Chloro-1'-({5-chloro-1-[2- (methylsulfonyl)ethy...)
Affinity DataEC50:  66nM. Assay description: To measure anti-RSV activity of compounds, 96-well plates are seeded with 6×103 cells per well in Dulbecco's modified Eagle's medium (DMEM) c...
Ligand InfoPC cidPC sid
In DepthDetails US Patent