BDBM324759 US10189840, Example 5
SMILES Cc1ccc(C)c(c1)C1CC(O)c2nc3ccc(nc3n12)-c1cnc(nc1)C(C)(C)O
InChI Key InChIKey=PAMLATFAJUQAAY-UHFFFAOYSA-N
Data  1 IC50
  Tab Delimited (TSV)   2D SDfile   Computed 3D by Vconf -m prep SDfile
Find this compound or compounds like it in BindingDB:
Activity Spreadsheet -- Enzyme Inhibition Constant Data from BindingDB
Found 1 hit for monomerid = 324759
TargetTumor necrosis factor(Homo sapiens (Human))
Bristol-Myers Squibb
US Patent
LigandPNGBDBM324759(US10189840, Example 5)
Affinity DataIC50: <1.00E+3nM. Assay description: Test compounds serially diluted in DMSO were plated in an assay plate (Labcyte, Cat. #LP-0200) at final concentrations ranging from 0.004 μM to ...
Ligand InfoPC cidPC sid
In DepthDetails US Patent